Skip to content

Check all stages pass in unit test (#1299) #11

Check all stages pass in unit test (#1299)

Check all stages pass in unit test (#1299) #11

Triggered via push November 13, 2024 22:37
Status Success
Total duration 18m 32s
Artifacts 2
Matrix: AlpiniFunctionalTests
Matrix: AlpiniUnitTests
Matrix: AvroCompatibilityTests
Matrix: PulsarVeniceIntegrationTests
CompatibilityTestsCompletionCheck
0s
CompatibilityTestsCompletionCheck
Fit to window
Zoom out
Zoom in

Annotations

17 errors
com.linkedin.venice.router.TestReadForHttpClient5 ► testRead: internal/venice-test-common/src/integrationTest/java/com/linkedin/venice/router/TestRead.java#L300
Failed test found in: IntegrationTests_1090-artifacts/internal/venice-test-common/build/test-results/integrationTests_1090/TEST-com.linkedin.venice.router.TestReadForHttpClient5.xml IntegrationTests_1090-artifacts/internal/venice-test-common/build/test-results/integrationTests_1090/TEST-com.linkedin.venice.router.TestReadForHttpClient5.xml internal/venice-test-common/build/test-results/integrationTests_1090/TEST-com.linkedin.venice.router.TestReadForHttpClient5.xml internal/venice-test-common/build/test-results/integrationTests_1090/TEST-com.linkedin.venice.router.TestReadForHttpClient5.xml Error: java.util.concurrent.ExecutionException: com.linkedin.venice.client.exceptions.VeniceClientHttpException: http status: 502, StreamResponse[headers={content-length=110, content-type=text/plain, X-VENICE-COMPRESSION-STRATEGY=0, X-VENICE-RCU=1, X-VENICE-SCHEMA-ID=-1},cookies=[],status=502]
com.linkedin.venice.consumer.TestChangelogConsumer ► testSpecificRecordVeniceChangelogConsumer: internal/venice-test-common/src/integrationTest/java/com/linkedin/venice/consumer/TestChangelogConsumer.java#L851
Failed test found in: IntegrationTests_1030-artifacts/internal/venice-test-common/build/test-results/integrationTests_1030/TEST-com.linkedin.venice.consumer.TestChangelogConsumer.xml IntegrationTests_1030-artifacts/internal/venice-test-common/build/test-results/integrationTests_1030/TEST-com.linkedin.venice.consumer.TestChangelogConsumerWithParallelProcessing.xml internal/venice-test-common/build/test-results/integrationTests_1030/TEST-com.linkedin.venice.consumer.TestChangelogConsumer.xml internal/venice-test-common/build/test-results/integrationTests_1030/TEST-com.linkedin.venice.consumer.TestChangelogConsumerWithParallelProcessing.xml Error: java.lang.AssertionError: expected [2] but found [1]
com.linkedin.venice.consumer.TestChangelogConsumerWithParallelProcessing ► testSpecificRecordBootstrappingVeniceChangelogConsumer: internal/venice-test-common/src/integrationTest/java/com/linkedin/venice/consumer/TestChangelogConsumer.java#L735
Failed test found in: IntegrationTests_1030-artifacts/internal/venice-test-common/build/test-results/integrationTests_1030/TEST-com.linkedin.venice.consumer.TestChangelogConsumerWithParallelProcessing.xml internal/venice-test-common/build/test-results/integrationTests_1030/TEST-com.linkedin.venice.consumer.TestChangelogConsumerWithParallelProcessing.xml Error: java.lang.AssertionError: expected [2] but found [1]
com.linkedin.venice.endToEnd.MetaSystemStoreTest ► bootstrapMetaSystemStore: services/venice-controller/src/main/java/com/linkedin/venice/controller/VeniceHelixAdmin.java#L3177
Failed test found in: IntegrationTests_1500-artifacts/internal/venice-test-common/build/test-results/integrationTests_1500/TEST-com.linkedin.venice.endToEnd.MetaSystemStoreTest.xml internal/venice-test-common/build/test-results/integrationTests_1500/TEST-com.linkedin.venice.endToEnd.MetaSystemStoreTest.xml Error: java.lang.AssertionError: New store: venice_store_4b94603aa8_60351a53 should be created successfully, but got error: An error occurred during controller request. controller = http://localhost:34479, route = /new_store, params = [owner=test_owner, key_schema="int", cluster_name=venice-cluster0, hostname=localhost, store_name=venice_store_4b94603aa8_60351a53, value_schema={
com.linkedin.venice.endToEnd.MetaSystemStoreTest ► testThinClientMetaStoreBasedRepositoryWithLargeValueSchemas: clients/da-vinci-client/src/main/java/com/linkedin/davinci/repository/NativeMetadataRepository.java#L190
Failed test found in: IntegrationTests_1500-artifacts/internal/venice-test-common/build/test-results/integrationTests_1500/TEST-com.linkedin.venice.endToEnd.MetaSystemStoreTest.xml internal/venice-test-common/build/test-results/integrationTests_1500/TEST-com.linkedin.venice.endToEnd.MetaSystemStoreTest.xml Error: com.linkedin.venice.exceptions.VeniceNoStoreException: Store: venice_store_5341b0c965_61bd3cc2 does not exist.
com.linkedin.venice.endToEnd.TestPushJobWithNativeReplication ► testTargetedRegionPushJobFullConsumptionForBatchStore: IntegrationTests_1220-artifacts/internal/venice-test-common/build/test-results/integrationTests_1220/TEST-com.linkedin.venice.endToEnd.TestPushJobWithNativeReplication.xml#L0
Failed test found in: IntegrationTests_1220-artifacts/internal/venice-test-common/build/test-results/integrationTests_1220/TEST-com.linkedin.venice.endToEnd.TestPushJobWithNativeReplication.xml Error: org.testng.internal.thread.ThreadTimeoutException: Method com.linkedin.venice.endToEnd.TestPushJobWithNativeReplication.testTargetedRegionPushJobFullConsumptionForBatchStore() didn't finish within the time-out 240000
com.linkedin.venice.endToEnd.TestPushJobWithNativeReplication ► testTargetedRegionPushJobFullConsumptionForBatchStore: internal/venice-test-common/build/test-results/integrationTests_1220/TEST-com.linkedin.venice.endToEnd.TestPushJobWithNativeReplication.xml#L0
Failed test found in: internal/venice-test-common/build/test-results/integrationTests_1220/TEST-com.linkedin.venice.endToEnd.TestPushJobWithNativeReplication.xml Error: org.testng.internal.thread.ThreadTimeoutException: Method com.linkedin.venice.endToEnd.TestPushJobWithNativeReplication.testTargetedRegionPushJobFullConsumptionForBatchStore() didn't finish within the time-out 240000
com.linkedin.venice.endToEnd.TestBatchForRocksDB ► testBatchJobSnapshots[2](true): internal/venice-test-common/src/integrationTest/java/com/linkedin/venice/endToEnd/TestBatch.java#L1428
Failed test found in: IntegrationTests_1230-artifacts/internal/venice-test-common/build/test-results/integrationTests_1230/TEST-com.linkedin.venice.endToEnd.TestBatchForRocksDB.xml internal/venice-test-common/build/test-results/integrationTests_1230/TEST-com.linkedin.venice.endToEnd.TestBatchForRocksDB.xml Error: java.util.concurrent.ExecutionException: com.linkedin.venice.client.exceptions.VeniceClientHttpException: http status: 503, com.linkedin.alpini.router.api.RouterException: store_307075aa91_2668d79d_v3, partition 2 is not available to serve request of type: SINGLE_GET
com.linkedin.venice.endToEnd.TestBatchForRocksDB ► testCompressingRecord[0](false, false): internal/venice-test-common/src/integrationTest/java/com/linkedin/venice/endToEnd/TestBatch.java#L249
Failed test found in: IntegrationTests_1230-artifacts/internal/venice-test-common/build/test-results/integrationTests_1230/TEST-com.linkedin.venice.endToEnd.TestBatchForRocksDB.xml internal/venice-test-common/build/test-results/integrationTests_1230/TEST-com.linkedin.venice.endToEnd.TestBatchForRocksDB.xml Error: java.util.concurrent.ExecutionException: com.linkedin.venice.client.exceptions.VeniceClientHttpException: http status: 503, com.linkedin.alpini.router.api.RouterException: store_33eb0f40f7_daef2cc_v1, partition 1 is not available to serve request of type: SINGLE_GET
com.linkedin.venice.endToEnd.TestBatchForRocksDB ► testBatchJobSnapshots[2](true): internal/venice-test-common/src/integrationTest/java/com/linkedin/venice/endToEnd/TestBatch.java#L1428
Failed test found in: IntegrationTests_1230-artifacts/internal/venice-test-common/build/test-results/integrationTests_1230/TEST-com.linkedin.venice.endToEnd.TestBatchForRocksDB.xml internal/venice-test-common/build/test-results/integrationTests_1230/TEST-com.linkedin.venice.endToEnd.TestBatchForRocksDB.xml Error: java.util.concurrent.ExecutionException: com.linkedin.venice.client.exceptions.VeniceClientHttpException: http status: 503, com.linkedin.alpini.router.api.RouterException: store_a14554e89d_3968b5b_v2, partition 1 is not available to serve request of type: SINGLE_GET
com.linkedin.venice.endToEnd.TestBatchForRocksDB ► testCompressingRecord[0](false, false): internal/venice-test-common/src/integrationTest/java/com/linkedin/venice/endToEnd/TestBatch.java#L249
Failed test found in: IntegrationTests_1230-artifacts/internal/venice-test-common/build/test-results/integrationTests_1230/TEST-com.linkedin.venice.endToEnd.TestBatchForRocksDB.xml internal/venice-test-common/build/test-results/integrationTests_1230/TEST-com.linkedin.venice.endToEnd.TestBatchForRocksDB.xml Error: java.util.concurrent.ExecutionException: com.linkedin.venice.client.exceptions.VeniceClientHttpException: http status: 503, com.linkedin.alpini.router.api.RouterException: store_a395230e02_f42fdb58_v1, partition 2 is not available to serve request of type: SINGLE_GET
com.linkedin.venice.endToEnd.TestBatchForRocksDB ► testBatchJobSnapshots[2](true): internal/venice-test-common/src/integrationTest/java/com/linkedin/venice/endToEnd/TestBatch.java#L1428
Failed test found in: IntegrationTests_1230-artifacts/internal/venice-test-common/build/test-results/integrationTests_1230/TEST-com.linkedin.venice.endToEnd.TestBatchForRocksDB.xml internal/venice-test-common/build/test-results/integrationTests_1230/TEST-com.linkedin.venice.endToEnd.TestBatchForRocksDB.xml Error: java.util.concurrent.ExecutionException: com.linkedin.venice.client.exceptions.VeniceClientHttpException: http status: 503, com.linkedin.alpini.router.api.RouterException: store_ba14167853_f75679_v2, partition 1 is not available to serve request of type: SINGLE_GET
com.linkedin.venice.endToEnd.BlobP2PTransferAmongServersTest ► testBlobP2PTransferAmongServersForBatchStore: internal/venice-test-common/src/integrationTest/java/com/linkedin/venice/endToEnd/BlobP2PTransferAmongServersTest.java#L123
Failed test found in: IntegrationTests_1130-artifacts/internal/venice-test-common/build/test-results/integrationTests_1130/TEST-com.linkedin.venice.endToEnd.BlobP2PTransferAmongServersTest.xml IntegrationTests_1130-artifacts/internal/venice-test-common/build/test-results/integrationTests_1130/TEST-com.linkedin.venice.endToEnd.BlobP2PTransferAmongServersTest.xml IntegrationTests_1130-artifacts/internal/venice-test-common/build/test-results/integrationTests_1130/TEST-com.linkedin.venice.endToEnd.BlobP2PTransferAmongServersTest.xml IntegrationTests_1130-artifacts/internal/venice-test-common/build/test-results/integrationTests_1130/TEST-com.linkedin.venice.endToEnd.BlobP2PTransferAmongServersTest.xml IntegrationTests_1130-artifacts/internal/venice-test-common/build/test-results/integrationTests_1130/TEST-com.linkedin.venice.endToEnd.BlobP2PTransferAmongServersTest.xml internal/venice-test-common/build/test-results/integrationTests_1130/TEST-com.linkedin.venice.endToEnd.BlobP2PTransferAmongServersTest.xml internal/venice-test-common/build/test-results/integrationTests_1130/TEST-com.linkedin.venice.endToEnd.BlobP2PTransferAmongServersTest.xml internal/venice-test-common/build/test-results/integrationTests_1130/TEST-com.linkedin.venice.endToEnd.BlobP2PTransferAmongServersTest.xml internal/venice-test-common/build/test-results/integrationTests_1130/TEST-com.linkedin.venice.endToEnd.BlobP2PTransferAmongServersTest.xml internal/venice-test-common/build/test-results/integrationTests_1130/TEST-com.linkedin.venice.endToEnd.BlobP2PTransferAmongServersTest.xml Error: java.lang.AssertionError: expected [true] but found [false]
com.linkedin.venice.endToEnd.DaVinciClientTest ► testTypeChangeRecordTransformer[0](DaVinciConfig{managed=true, isolated=false, storageClass=MEMORY_BACKED_BY_DISK, cacheConfig=null, largeBatchRequestSplitThreshold=100}): clients/venice-push-job/src/main/java/com/linkedin/venice/hadoop/DefaultInputDataInfoProvider.java#L342
Failed test found in: IntegrationTests_1010-artifacts/internal/venice-test-common/build/test-results/integrationTests_1010/TEST-com.linkedin.venice.endToEnd.DaVinciClientTest.xml IntegrationTests_1010-artifacts/internal/venice-test-common/build/test-results/integrationTests_1010/TEST-com.linkedin.venice.endToEnd.DaVinciClientTest.xml IntegrationTests_1010-artifacts/internal/venice-test-common/build/test-results/integrationTests_1010/TEST-com.linkedin.venice.endToEnd.DaVinciClientTest.xml IntegrationTests_1010-artifacts/internal/venice-test-common/build/test-results/integrationTests_1010/TEST-com.linkedin.venice.endToEnd.DaVinciClientTest.xml IntegrationTests_1010-artifacts/internal/venice-test-common/build/test-results/integrationTests_1010/TEST-com.linkedin.venice.endToEnd.DaVinciClientTest.xml IntegrationTests_1010-artifacts/internal/venice-test-common/build/test-results/integrationTests_1010/TEST-com.linkedin.venice.endToEnd.DaVinciClientTest.xml internal/venice-test-common/build/test-results/integrationTests_1010/TEST-com.linkedin.venice.endToEnd.DaVinciClientTest.xml internal/venice-test-common/build/test-results/integrationTests_1010/TEST-com.linkedin.venice.endToEnd.DaVinciClientTest.xml internal/venice-test-common/build/test-results/integrationTests_1010/TEST-com.linkedin.venice.endToEnd.DaVinciClientTest.xml internal/venice-test-common/build/test-results/integrationTests_1010/TEST-com.linkedin.venice.endToEnd.DaVinciClientTest.xml internal/venice-test-common/build/test-results/integrationTests_1010/TEST-com.linkedin.venice.endToEnd.DaVinciClientTest.xml internal/venice-test-common/build/test-results/integrationTests_1010/TEST-com.linkedin.venice.endToEnd.DaVinciClientTest.xml Error: com.linkedin.venice.hadoop.exceptions.VeniceInconsistentSchemaException: Inconsistent file Avro schema found. File: int2string.avro.
com.linkedin.venice.endToEnd.BlobP2PTransferAmongServersTest ► testBlobP2PTransferAmongServersForBatchStore: internal/venice-test-common/src/integrationTest/java/com/linkedin/venice/endToEnd/BlobP2PTransferAmongServersTest.java#L123
Failed test found in: IntegrationTests_1130-artifacts/internal/venice-test-common/build/test-results/integrationTests_1130/TEST-com.linkedin.venice.endToEnd.BlobP2PTransferAmongServersTest.xml IntegrationTests_1130-artifacts/internal/venice-test-common/build/test-results/integrationTests_1130/TEST-com.linkedin.venice.endToEnd.BlobP2PTransferAmongServersTest.xml internal/venice-test-common/build/test-results/integrationTests_1130/TEST-com.linkedin.venice.endToEnd.BlobP2PTransferAmongServersTest.xml internal/venice-test-common/build/test-results/integrationTests_1130/TEST-com.linkedin.venice.endToEnd.BlobP2PTransferAmongServersTest.xml Error: java.lang.AssertionError: expected [true] but found [false]
com.linkedin.venice.endToEnd.BlobP2PTransferAmongServersTest ► testBlobP2PTransferAmongServersForHybridStore: internal/venice-test-common/src/integrationTest/java/com/linkedin/venice/endToEnd/BlobP2PTransferAmongServersTest.java#L367
Failed test found in: IntegrationTests_1130-artifacts/internal/venice-test-common/build/test-results/integrationTests_1130/TEST-com.linkedin.venice.endToEnd.BlobP2PTransferAmongServersTest.xml internal/venice-test-common/build/test-results/integrationTests_1130/TEST-com.linkedin.venice.endToEnd.BlobP2PTransferAmongServersTest.xml Error: java.lang.AssertionError: expected [true] but found [false]
com.linkedin.venice.endToEnd.BlobP2PTransferAmongServersTest ► testBlobTransferThrowExceptionIfSnapshotNotExisted: internal/venice-test-common/src/integrationTest/java/com/linkedin/venice/endToEnd/BlobP2PTransferAmongServersTest.java#L201
Failed test found in: IntegrationTests_1130-artifacts/internal/venice-test-common/build/test-results/integrationTests_1130/TEST-com.linkedin.venice.endToEnd.BlobP2PTransferAmongServersTest.xml internal/venice-test-common/build/test-results/integrationTests_1130/TEST-com.linkedin.venice.endToEnd.BlobP2PTransferAmongServersTest.xml Error: java.lang.AssertionError: expected [true] but found [false]

Artifacts

Produced during runtime
Name Size
AvroCompatibilityTests
4.35 MB
PulsarVeniceIntegrationTests
841 KB